{"text_format":"3","workbook":"xlsx","n_sheets":2,"sheets":["Sheet1","奖补企业清单"],"not_rendered":{"external_links":1,"defined_names":3},"read":"whole","date_system":"1900"}

{"sheet":"Sheet1","index":0,"n_rows":138,"n_cols":27,"rows_kept":138,"hidden":true,"merged":[[0,0,0,25],[1,0,2,0],[1,1,2,1],[1,2,2,2],[1,6,1,8],[1,9,2,9],[1,10,2,10],[1,11,2,11],[1,12,2,12],[1,13,2,13],[1,14,2,14],[1,15,2,15],[1,16,2,16],[1,17,2,17],[1,18,2,18],[1,19,2,19],[1,20,2,20],[1,21,2,21],[1,22,2,22],[1,23,2,23],[1,24,2,24],[1,25,2,25]]}
["2021年苏州工业园区产业转型升级（技术改造）专项资金项目综合评分表"]
["序号","企业名称","统一社会信用代码/组织机构代码","经济效益得分","智能化效益得分","综合素质认定","扣分项",null,null,"企业综合评价得分","分类","投入总金额","园区设备金额","园区采购比例超70%","理论奖补金额","【扣减项】省技改综合奖补","【扣减项】省转型升级技改奖补","【扣减项】节能改造奖补","【扣减项】人工智能奖补","【扣减项】科创委产业化落地固定资产兑现","【扣减项】投促委核心产业政策奖补","扣减后奖补金额","扣减后奖补金额","最终奖补比例","项目纳统比对","备注","扣减后奖补金额"]
[{"$nulls":3},{"v":0.7,"d":"70%"},{"v":0.2,"d":"20%"},{"v":0.1,"d":"10%"},"项目投资情况未列入统计部门统计，或者统计部门显示企业年度的固定资产投资金额不足500万元（不含软件）","专家现场核验与评估时，发现技改投入资金与项目申报书描述存在较大不符","申报中所涉及的固定资产（含软、硬件设备）原则上在企业内使用不少于三年，如核查时企业无正当理由，设备不在现场的"]
[1,{"$f":"[1]苏州工业园区工业企业技术改造经济效益表!B4","v":"SEW-传动设备(苏州)有限公司"},{"$f":"[1]苏州工业园区工业企业技术改造经济效益表!C4","v":"91320594730135548U"},{"$f":"[1]经济效益!N4","v":{"v":23.699003537862,"d":"23.70"}},{"$f":"[1]智能化效益!R4","v":{"v":80.2835,"d":"80.28"}},{"$f":"IF([1]综合素质认定!O4>10,10,[1]综合素质认定!O4)","v":1},0,0,0,{"$f":"D4*$D$3+E4*$E$3+F4-G4-H4-I4","v":{"v":33.6460024765034,"d":"33.65"}},{"$f":"IF(J4<[1]奖补比例!$D$2,\"D\",IF(J4<[1]奖补比例!$C$2,\"C\",IF(J4<[1]奖补比例!$B$2,\"B\",\"A\")))","v":"D"},{"$f":"[1]苏州工业园区工业企业技术改造经济效益表!AJ4","v":{"v":1e-6,"d":"0"}},{"$f":"[1]苏州工业园区工业企业技术改造经济效益表!AM4","v":0},{"$f":"IF([1]苏州工业园区工业企业技术改造经济效益表!AN4>=0.7,[1]苏州工业园区工业企业技术改造经济效益表!AM4,0)","v":0},{"$f":"IF(IF(K4=\"A\",[1]苏州工业园区工业企业技术改造经济效益表!AJ4*[1]奖补比例!$B$3+N4*[1]奖补比例!$B$5,IF(K4=\"B\",[1]苏州工业园区工业企业技术改造经济效益表!AJ4*[1]奖补比例!$C$3+N4*[1]奖补比例!$C$5,IF(K4=\"C\",[1]苏州工业园区工业企业技术改造经济效益表!AJ4*[1]奖补比例!$D$3+N4*[1]奖补比例!$D$5,[1]苏州工业园区工业企业技术改造经济效益表!AJ4*[1]奖补比例!$E$3+N4*[1]奖补比例!$E$5)))*[1]奖补比例!$G$2>1000,1000,IF(K4=\"A\",[1]苏州工业园区工业企业技术改造经济效益表!AJ4*[1]奖补比例!$B$3+N4*[1]奖补比例!$B$5,IF(K4=\"B\",[1]苏州工业园区工业企业技术改造经济效益表!AJ4*[1]奖补比例!$C$3+N4*[1]奖补比例!$C$5,IF(K4=\"C\",[1]苏州工业园区工业企业技术改造经济效益表!AJ4*[1]奖补比例!$D$3+N4*[1]奖补比例!$D$5,[1]苏州工业园区工业企业技术改造经济效益表!AJ4*[1]奖补比例!$E$3+N4*[1]奖补比例!$E$5)))*[1]奖补比例!$G$2)","v":{"v":2.388654e-8,"d":"0"}},0,0,0,{"$f":"[1]【扣减】人工智能奖补!F3","v":0},0,{"$f":"[1]【扣减】投促委!F3","v":0},0,{"$f":"ROUND(V4,2)","v":{"v":0,"d":"0.00"}},{"v":0,"d":"0.00%"},{"$f":"IF([1]项目纳统比对表!D4=\"否\",\"未纳统\",IF([1]项目纳统比对表!F4=\"否\",\"不足500万元\",\"\"))","v":""},"未通过",{"v":0,"d":"0.00"}]
[2,{"$f":"[1]苏州工业园区工业企业技术改造经济效益表!B5","v":"SEW-电机(苏州)有限公司"},{"$f":"[1]苏州工业园区工业企业技术改造经济效益表!C5","v":"91320594759661656F"},{"$f":"[1]经济效益!N5","v":{"v":68.6556842457016,"d":"68.66"}},{"$f":"[1]智能化效益!R5","v":{"v":81.5512,"d":"81.55"}},{"$f":"IF([1]综合素质认定!O5>10,10,[1]综合素质认定!O5)","v":0},0,0,0,{"v":64.3692189719911,"d":"64.37"},{"$f":"IF(J5<[1]奖补比例!$D$2,\"D\",IF(J5<[1]奖补比例!$C$2,\"C\",IF(J5<[1]奖补比例!$B$2,\"B\",\"A\")))","v":"B"},{"$f":"[1]苏州工业园区工业企业技术改造经济效益表!AJ5","v":7597.02},{"$f":"[1]苏州工业园区工业企业技术改造经济效益表!AM5","v":188.51},{"$f":"IF([1]苏州工业园区工业企业技术改造经济效益表!AN5>=0.7,[1]苏州工业园区工业企业技术改造经济效益表!AM5,0)","v":0},{"$f":"IF(IF(K5=\"A\",[1]苏州工业园区工业企业技术改造经济效益表!AJ5*[1]奖补比例!$B$3+N5*[1]奖补比例!$B$5,IF(K5=\"B\",[1]苏州工业园区工业企业技术改造经济效益表!AJ5*[1]奖补比例!$C$3+N5*[1]奖补比例!$C$5,IF(K5=\"C\",[1]苏州工业园区工业企业技术改造经济效益表!AJ5*[1]奖补比例!$D$3+N5*[1]奖补比例!$D$5,[1]苏州工业园区工业企业技术改造经济效益表!AJ5*[1]奖补比例!$E$3+N5*[1]奖补比例!$E$5)))*[1]奖补比例!$G$2>1000,1000,IF(K5=\"A\",[1]苏州工业园区工业企业技术改造经济效益表!AJ5*[1]奖补比例!$B$3+N5*[1]奖补比例!$B$5,IF(K5=\"B\",[1]苏州工业园区工业企业技术改造经济效益表!AJ5*[1]奖补比例!$C$3+N5*[1]奖补比例!$C$5,IF(K5=\"C\",[1]苏州工业园区工业企业技术改造经济效益表!AJ5*[1]奖补比例!$D$3+N5*[1]奖补比例!$D$5,[1]苏州工业园区工业企业技术改造经济效益表!AJ5*[1]奖补比例!$E$3+N5*[1]奖补比例!$E$5)))*[1]奖补比例!$G$2)","v":{"v":483.9107256288,"d":"483.91"}},{"$f":"VLOOKUP(B5,[1]【扣减】省技改综合奖补!$C$2:$E$59,3,0)/10000","v":34},0,0,{"$f":"[1]【扣减】人工智能奖补!F4","v":0},0,{"$f":"[1]【扣减】投促委!F4","v":1500},0,{"v":0,"d":"0.00"},{"$f":"O5/L5","v":{"v":0.06369744,"d":"6.37%"}},{"$f":"IF([1]项目纳统比对表!D5=\"否\",\"未纳统\",IF([1]项目纳统比对表!F5=\"否\",\"不足500万元\",\"\"))","v":"未纳统"},null,{"v":0,"d":"0.00"}]
[3,{"$f":"[1]苏州工业园区工业企业技术改造经济效益表!B6","v":"艾利（苏州）有限公司"},{"$f":"[1]苏州工业园区工业企业技术改造经济效益表!C6","v":"91320594769869813E"},{"$f":"[1]经济效益!N6","v":{"v":56.6126666726958,"d":"56.61"}},{"$f":"[1]智能化效益!R6","v":91.94},{"$f":"IF([1]综合素质认定!O6>10,10,[1]综合素质认定!O6)","v":0},0,0,0,{"v":58.0168666708871,"d":"58.02"},{"$f":"IF(J6<[1]奖补比例!$D$2,\"D\",IF(J6<[1]奖补比例!$C$2,\"C\",IF(J6<[1]奖补比例!$B$2,\"B\",\"A\")))","v":"C"},{"$f":"[1]苏州工业园区工业企业技术改造经济效益表!AJ6","v":704.87},{"$f":"[1]苏州工业园区工业企业技术改造经济效益表!AM6","v":0},{"$f":"IF([1]苏州工业园区工业企业技术改造经济效益表!AN6>=0.7,[1]苏州工业园区工业企业技术改造经济效益表!AM6,0)","v":0},{"$f":"IF(IF(K6=\"A\",[1]苏州工业园区工业企业技术改造经济效益表!AJ6*[1]奖补比例!$B$3+N6*[1]奖补比例!$B$5,IF(K6=\"B\",[1]苏州工业园区工业企业技术改造经济效益表!AJ6*[1]奖补比例!$C$3+N6*[1]奖补比例!$C$5,IF(K6=\"C\",[1]苏州工业园区工业企业技术改造经济效益表!AJ6*[1]奖补比例!$D$3+N6*[1]奖补比例!$D$5,[1]苏州工业园区工业企业技术改造经济效益表!AJ6*[1]奖补比例!$E$3+N6*[1]奖补比例!$E$5)))*[1]奖补比例!$G$2>1000,1000,IF(K6=\"A\",[1]苏州工业园区工业企业技术改造经济效益表!AJ6*[1]奖补比例!$B$3+N6*[1]奖补比例!$B$5,IF(K6=\"B\",[1]苏州工业园区工业企业技术改造经济效益表!AJ6*[1]奖补比例!$C$3+N6*[1]奖补比例!$C$5,IF(K6=\"C\",[1]苏州工业园区工业企业技术改造经济效益表!AJ6*[1]奖补比例!$D$3+N6*[1]奖补比例!$D$5,[1]苏州工业园区工业企业技术改造经济效益表!AJ6*[1]奖补比例!$E$3+N6*[1]奖补比例!$E$5)))*[1]奖补比例!$G$2)","v":{"v":28.061509083,"d":"28.06"}},0,0,0,{"$f":"[1]【扣减】人工智能奖补!F5","v":0},0,{"$f":"[1]【扣减】投促委!F5","v":0},{"v":28.061509083,"d":"28.06"},28.06,{"v":0.0398109,"d":"3.98%"},{"$f":"IF([1]项目纳统比对表!D6=\"否\",\"未纳统\",IF([1]项目纳统比对表!F6=\"否\",\"不足500万元\",\"\"))","v":"未纳统"},null,28.06]
[4,{"$f":"[1]苏州工业园区工业企业技术改造经济效益表!B7","v":"艾默生环境优化技术（苏州）有限公司"},{"$f":"[1]苏州工业园区工业企业技术改造经济效益表!C7","v":"9132059460820727XQ"},{"$f":"[1]经济效益!N7","v":{"v":53.1028856914368,"d":"53.10"}},{"$f":"[1]智能化效益!R7","v":{"v":89.6,"d":"89.60"}},{"$f":"IF([1]综合素质认定!O7>10,10,[1]综合素质认定!O7)","v":1},0,0,0,{"v":56.0920199840058,"d":"56.09"},{"$f":"IF(J7<[1]奖补比例!$D$2,\"D\",IF(J7<[1]奖补比例!$C$2,\"C\",IF(J7<[1]奖补比例!$B$2,\"B\",\"A\")))","v":"C"},{"$f":"[1]苏州工业园区工业企业技术改造经济效益表!AJ7","v":3708.31},{"$f":"[1]苏州工业园区工业企业技术改造经济效益表!AM7","v":358.66},{"$f":"IF([1]苏州工业园区工业企业技术改造经济效益表!AN7>=0.7,[1]苏州工业园区工业企业技术改造经济效益表!AM7,0)","v":0},{"$f":"IF(IF(K7=\"A\",[1]苏州工业园区工业企业技术改造经济效益表!AJ7*[1]奖补比例!$B$3+N7*[1]奖补比例!$B$5,IF(K7=\"B\",[1]苏州工业园区工业企业技术改造经济效益表!AJ7*[1]奖补比例!$C$3+N7*[1]奖补比例!$C$5,IF(K7=\"C\",[1]苏州工业园区工业企业技术改造经济效益表!AJ7*[1]奖补比例!$D$3+N7*[1]奖补比例!$D$5,[1]苏州工业园区工业企业技术改造经济效益表!AJ7*[1]奖补比例!$E$3+N7*[1]奖补比例!$E$5)))*[1]奖补比例!$G$2>1000,1000,IF(K7=\"A\",[1]苏州工业园区工业企业技术改造经济效益表!AJ7*[1]奖补比例!$B$3+N7*[1]奖补比例!$B$5,IF(K7=\"B\",[1]苏州工业园区工业企业技术改造经济效益表!AJ7*[1]奖补比例!$C$3+N7*[1]奖补比例!$C$5,IF(K7=\"C\",[1]苏州工业园区工业企业技术改造经济效益表!AJ7*[1]奖补比例!$D$3+N7*[1]奖补比例!$D$5,[1]苏州工业园区工业企业技术改造经济效益表!AJ7*[1]奖补比例!$E$3+N7*[1]奖补比例!$E$5)))*[1]奖补比例!$G$2)","v":{"v":147.631158579,"d":"147.63"}},{"$f":"VLOOKUP(B7,[1]【扣减】省技改综合奖补!$C$2:$E$59,3,0)/10000","v":38},0,0,{"$f":"[1]【扣减】人工智能奖补!F6","v":0},0,{"$f":"[1]【扣减】投促委!F6","v":0},{"v":109.631158579,"d":"109.63"},109.63,{"v":0.0398109,"d":"3.98%"},{"$f":"IF([1]项目纳统比对表!D7=\"否\",\"未纳统\",IF([1]项目纳统比对表!F7=\"否\",\"不足500万元\",\"\"))","v":""},null,109.63]
[5,{"$f":"[1]苏州工业园区工业企业技术改造经济效益表!B8","v":"爱发科电子材料（苏州）有限公司"},{"$f":"[1]苏州工业园区工业企业技术改造经济效益表!C8","v":"91320594687174022W"},{"$f":"[1]经济效益!N8","v":{"v":58.13700081863,"d":"58.14"}},{"$f":"[1]智能化效益!R8","v":{"v":80.0368,"d":"80.04"}},{"$f":"IF([1]综合素质认定!O8>10,10,[1]综合素质认定!O8)","v":1},0,0,0,{"v":57.703260573041,"d":"57.70"},{"$f":"IF(J8<[1]奖补比例!$D$2,\"D\",IF(J8<[1]奖补比例!$C$2,\"C\",IF(J8<[1]奖补比例!$B$2,\"B\",\"A\")))","v":"C"},{"$f":"[1]苏州工业园区工业企业技术改造经济效益表!AJ8","v":745.45},{"$f":"[1]苏州工业园区工业企业技术改造经济效益表!AM8","v":14.35},{"$f":"IF([1]苏州工业园区工业企业技术改造经济效益表!AN8>=0.7,[1]苏州工业园区工业企业技术改造经济效益表!AM8,0)","v":0},{"$f":"IF(IF(K8=\"A\",[1]苏州工业园区工业企业技术改造经济效益表!AJ8*[1]奖补比例!$B$3+N8*[1]奖补比例!$B$5,IF(K8=\"B\",[1]苏州工业园区工业企业技术改造经济效益表!AJ8*[1]奖补比例!$C$3+N8*[1]奖补比例!$C$5,IF(K8=\"C\",[1]苏州工业园区工业企业技术改造经济效益表!AJ8*[1]奖补比例!$D$3+N8*[1]奖补比例!$D$5,[1]苏州工业园区工业企业技术改造经济效益表!AJ8*[1]奖补比例!$E$3+N8*[1]奖补比例!$E$5)))*[1]奖补比例!$G$2>1000,1000,IF(K8=\"A\",[1]苏州工业园区工业企业技术改造经济效益表!AJ8*[1]奖补比例!$B$3+N8*[1]奖补比例!$B$5,IF(K8=\"B\",[1]苏州工业园区工业企业技术改造经济效益表!AJ8*[1]奖补比例!$C$3+N8*[1]奖补比例!$C$5,IF(K8=\"C\",[1]苏州工业园区工业企业技术改造经济效益表!AJ8*[1]奖补比例!$D$3+N8*[1]奖补比例!$D$5,[1]苏州工业园区工业企业技术改造经济效益表!AJ8*[1]奖补比例!$E$3+N8*[1]奖补比例!$E$5)))*[1]奖补比例!$G$2)","v":{"v":29.677035405,"d":"29.68"}},0,0,0,{"$f":"[1]【扣减】人工智能奖补!F7","v":0},0,{"$f":"[1]【扣减】投促委!F7","v":0},{"v":29.677035405,"d":"29.68"},29.68,{"v":0.0398109,"d":"3.98%"},{"$f":"IF([1]项目纳统比对表!D8=\"否\",\"未纳统\",IF([1]项目纳统比对表!F8=\"否\",\"不足500万元\",\"\"))","v":""},null,29.68]
[6,{"$f":"[1]苏州工业园区工业企业技术改造经济效益表!B9","v":"安波福电子（苏州）有限公司"},{"$f":"[1]苏州工业园区工业企业技术改造经济效益表!C9","v":"9132059475393991XQ"},{"$f":"[1]经济效益!N9","v":{"v":61.1456950386546,"d":"61.15"}},{"$f":"[1]智能化效益!R9","v":{"v":94.7865,"d":"94.79"}},{"$f":"IF([1]综合素质认定!O9>10,10,[1]综合素质认定!O9)","v":3},0,0,0,{"v":64.7592865270582,"d":"64.76"},{"$f":"IF(J9<[1]奖补比例!$D$2,\"D\",IF(J9<[1]奖补比例!$C$2,\"C\",IF(J9<[1]奖补比例!$B$2,\"B\",\"A\")))","v":"B"},{"$f":"[1]苏州工业园区工业企业技术改造经济效益表!AJ9","v":7028.94},{"$f":"[1]苏州工业园区工业企业技术改造经济效益表!AM9","v":2305.16},{"$f":"IF([1]苏州工业园区工业企业技术改造经济效益表!AN9>=0.7,[1]苏州工业园区工业企业技术改造经济效益表!AM9,0)","v":0},{"$f":"IF(IF(K9=\"A\",[1]苏州工业园区工业企业技术改造经济效益表!AJ9*[1]奖补比例!$B$3+N9*[1]奖补比例!$B$5,IF(K9=\"B\",[1]苏州工业园区工业企业技术改造经济效益表!AJ9*[1]奖补比例!$C$3+N9*[1]奖补比例!$C$5,IF(K9=\"C\",[1]苏州工业园区工业企业技术改造经济效益表!AJ9*[1]奖补比例!$D$3+N9*[1]奖补比例!$D$5,[1]苏州工业园区工业企业技术改造经济效益表!AJ9*[1]奖补比例!$E$3+N9*[1]奖补比例!$E$5)))*[1]奖补比例!$G$2>1000,1000,IF(K9=\"A\",[1]苏州工业园区工业企业技术改造经济效益表!AJ9*[1]奖补比例!$B$3+N9*[1]奖补比例!$B$5,IF(K9=\"B\",[1]苏州工业园区工业企业技术改造经济效益表!AJ9*[1]奖补比例!$C$3+N9*[1]奖补比例!$C$5,IF(K9=\"C\",[1]苏州工业园区工业企业技术改造经济效益表!AJ9*[1]奖补比例!$D$3+N9*[1]奖补比例!$D$5,[1]苏州工业园区工业企业技术改造经济效益表!AJ9*[1]奖补比例!$E$3+N9*[1]奖补比例!$E$5)))*[1]奖补比例!$G$2)","v":{"v":447.7254839136,"d":"447.73"}},{"$f":"VLOOKUP(B9,[1]【扣减】省技改综合奖补!$C$2:$E$59,3,0)/10000","v":37},0,0,{"$f":"[1]【扣减】人工智能奖补!F8","v":0},0,{"$f":"[1]【扣减】投促委!F8","v":400},{"v":10.7254839136,"d":"10.73"},10.73,{"v":0.06369744,"d":"6.37%"},{"$f":"IF([1]项目纳统比对表!D9=\"否\",\"未纳统\",IF([1]项目纳统比对表!F9=\"否\",\"不足500万元\",\"\"))","v":""},null,10.73]
[7,{"$f":"[1]苏州工业园区工业企业技术改造经济效益表!B10","v":"安拓锐高新测试技术（苏州）有限公司"},{"$f":"[1]苏州工业园区工业企业技术改造经济效益表!C10","v":"913205947923058131"},{"$f":"[1]经济效益!N10","v":{"v":83.932420576572,"d":"83.93"}},{"$f":"[1]智能化效益!R10","v":{"v":88.335,"d":"88.34"}},{"$f":"IF([1]综合素质认定!O10>10,10,[1]综合素质认定!O10)","v":1},0,0,0,{"v":77.4196944036004,"d":"77.42"},{"$f":"IF(J10<[1]奖补比例!$D$2,\"D\",IF(J10<[1]奖补比例!$C$2,\"C\",IF(J10<[1]奖补比例!$B$2,\"B\",\"A\")))","v":"B"},{"$f":"[1]苏州工业园区工业企业技术改造经济效益表!AJ10","v":963.52},{"$f":"[1]苏州工业园区工业企业技术改造经济效益表!AM10","v":0},{"$f":"IF([1]苏州工业园区工业企业技术改造经济效益表!AN10>=0.7,[1]苏州工业园区工业企业技术改造经济效益表!AM10,0)","v":0},{"$f":"IF(IF(K10=\"A\",[1]苏州工业园区工业企业技术改造经济效益表!AJ10*[1]奖补比例!$B$3+N10*[1]奖补比例!$B$5,IF(K10=\"B\",[1]苏州工业园区工业企业技术改造经济效益表!AJ10*[1]奖补比例!$C$3+N10*[1]奖补比例!$C$5,IF(K10=\"C\",[1]苏州工业园区工业企业技术改造经济效益表!AJ10*[1]奖补比例!$D$3+N10*[1]奖补比例!$D$5,[1]苏州工业园区工业企业技术改造经济效益表!AJ10*[1]奖补比例!$E$3+N10*[1]奖补比例!$E$5)))*[1]奖补比例!$G$2>1000,1000,IF(K10=\"A\",[1]苏州工业园区工业企业技术改造经济效益表!AJ10*[1]奖补比例!$B$3+N10*[1]奖补比例!$B$5,IF(K10=\"B\",[1]苏州工业园区工业企业技术改造经济效益表!AJ10*[1]奖补比例!$C$3+N10*[1]奖补比例!$C$5,IF(K10=\"C\",[1]苏州工业园区工业企业技术改造经济效益表!AJ10*[1]奖补比例!$D$3+N10*[1]奖补比例!$D$5,[1]苏州工业园区工业企业技术改造经济效益表!AJ10*[1]奖补比例!$E$3+N10*[1]奖补比例!$E$5)))*[1]奖补比例!$G$2)","v":{"v":61.3737573888,"d":"61.37"}},0,0,0,{"$f":"[1]【扣减】人工智能奖补!F9","v":0},0,{"$f":"[1]【扣减】投促委!F9","v":0},{"v":61.3737573888,"d":"61.37"},61.37,{"v":0.06369744,"d":"6.37%"},{"$f":"IF([1]项目纳统比对表!D10=\"否\",\"未纳统\",IF([1]项目纳统比对表!F10=\"否\",\"不足500万元\",\"\"))","v":""},null,61.37]
[8,{"$f":"[1]苏州工业园区工业企业技术改造经济效益表!B11","v":"安特（苏州）精密机械有限公司"},{"$f":"[1]苏州工业园区工业企业技术改造经济效益表!C11","v":"91320594608236716P"},{"$f":"[1]经济效益!N11","v":{"v":87.4053253454291,"d":"87.41"}},{"$f":"[1]智能化效益!R11","v":{"v":87.1729,"d":"87.17"}},{"$f":"IF([1]综合素质认定!O11>10,10,[1]综合素质认定!O11)","v":0},0,0,0,{"v":78.6183077418004,"d":"78.62"},{"$f":"IF(J11<[1]奖补比例!$D$2,\"D\",IF(J11<[1]奖补比例!$C$2,\"C\",IF(J11<[1]奖补比例!$B$2,\"B\",\"A\")))","v":"B"},{"$f":"[1]苏州工业园区工业企业技术改造经济效益表!AJ11","v":1069.47},{"$f":"[1]苏州工业园区工业企业技术改造经济效益表!AM11","v":356.58},{"$f":"IF([1]苏州工业园区工业企业技术改造经济效益表!AN11>=0.7,[1]苏州工业园区工业企业技术改造经济效益表!AM11,0)","v":0},{"$f":"IF(IF(K11=\"A\",[1]苏州工业园区工业企业技术改造经济效益表!AJ11*[1]奖补比例!$B$3+N11*[1]奖补比例!$B$5,IF(K11=\"B\",[1]苏州工业园区工业企业技术改造经济效益表!AJ11*[1]奖补比例!$C$3+N11*[1]奖补比例!$C$5,IF(K11=\"C\",[1]苏州工业园区工业企业技术改造经济效益表!AJ11*[1]奖补比例!$D$3+N11*[1]奖补比例!$D$5,[1]苏州工业园区工业企业技术改造经济效益表!AJ11*[1]奖补比例!$E$3+N11*[1]奖补比例!$E$5)))*[1]奖补比例!$G$2>1000,1000,IF(K11=\"A\",[1]苏州工业园区工业企业技术改造经济效益表!AJ11*[1]奖补比例!$B$3+N11*[1]奖补比例!$B$5,IF(K11=\"B\",[1]苏州工业园区工业企业技术改造经济效益表!AJ11*[1]奖补比例!$C$3+N11*[1]奖补比例!$C$5,IF(K11=\"C\",[1]苏州工业园区工业企业技术改造经济效益表!AJ11*[1]奖补比例!$D$3+N11*[1]奖补比例!$D$5,[1]苏州工业园区工业企业技术改造经济效益表!AJ11*[1]奖补比例!$E$3+N11*[1]奖补比例!$E$5)))*[1]奖补比例!$G$2)","v":{"v":68.1225011568,"d":"68.12"}},0,0,0,{"$f":"[1]【扣减】人工智能奖补!F10","v":0},0,{"$f":"[1]【扣减】投促委!F10","v":0},{"v":68.1225011568,"d":"68.12"},68.12,{"v":0.06369744,"d":"6.37%"},{"$f":"IF([1]项目纳统比对表!D11=\"否\",\"未纳统\",IF([1]项目纳统比对表!F11=\"否\",\"不足500万元\",\"\"))","v":"未纳统"},null,68.12]
[9,{"$f":"[1]苏州工业园区工业企业技术改造经济效益表!B12","v":"百得（苏州）电动工具有限公司"},{"$f":"[1]苏州工业园区工业企业技术改造经济效益表!C12","v":"91320594608205418E"},{"$f":"[1]经济效益!N12","v":61},{"$f":"[1]智能化效益!R12","v":85},{"$f":"IF([1]综合素质认定!O12>10,10,[1]综合素质认定!O12)","v":0},0,0,0,{"v":59.7,"d":"59.70"},{"$f":"IF(J12<[1]奖补比例!$D$2,\"D\",IF(J12<[1]奖补比例!$C$2,\"C\",IF(J12<[1]奖补比例!$B$2,\"B\",\"A\")))","v":"C"},{"$f":"[1]苏州工业园区工业企业技术改造经济效益表!AJ12","v":2102.41},{"$f":"[1]苏州工业园区工业企业技术改造经济效益表!AM12","v":21.12},{"$f":"IF([1]苏州工业园区工业企业技术改造经济效益表!AN12>=0.7,[1]苏州工业园区工业企业技术改造经济效益表!AM12,0)","v":0},{"$f":"IF(IF(K12=\"A\",[1]苏州工业园区工业企业技术改造经济效益表!AJ12*[1]奖补比例!$B$3+N12*[1]奖补比例!$B$5,IF(K12=\"B\",[1]苏州工业园区工业企业技术改造经济效益表!AJ12*[1]奖补比例!$C$3+N12*[1]奖补比例!$C$5,IF(K12=\"C\",[1]苏州工业园区工业企业技术改造经济效益表!AJ12*[1]奖补比例!$D$3+N12*[1]奖补比例!$D$5,[1]苏州工业园区工业企业技术改造经济效益表!AJ12*[1]奖补比例!$E$3+N12*[1]奖补比例!$E$5)))*[1]奖补比例!$G$2>1000,1000,IF(K12=\"A\",[1]苏州工业园区工业企业技术改造经济效益表!AJ12*[1]奖补比例!$B$3+N12*[1]奖补比例!$B$5,IF(K12=\"B\",[1]苏州工业园区工业企业技术改造经济效益表!AJ12*[1]奖补比例!$C$3+N12*[1]奖补比例!$C$5,IF(K12=\"C\",[1]苏州工业园区工业企业技术改造经济效益表!AJ12*[1]奖补比例!$D$3+N12*[1]奖补比例!$D$5,[1]苏州工业园区工业企业技术改造经济效益表!AJ12*[1]奖补比例!$E$3+N12*[1]奖补比例!$E$5)))*[1]奖补比例!$G$2)","v":{"v":83.698834269,"d":"83.70"}},{"$f":"VLOOKUP(B12,[1]【扣减】省技改综合奖补!$C$2:$E$59,3,0)/10000","v":23},0,0,{"$f":"[1]【扣减】人工智能奖补!F11","v":0},0,{"$f":"[1]【扣减】投促委!F11","v":0},{"v":60.698834269,"d":"60.70"},{"v":60.7,"d":"60.70"},{"v":0.0398109,"d":"3.98%"},{"$f":"IF([1]项目纳统比对表!D12=\"否\",\"未纳统\",IF([1]项目纳统比对表!F12=\"否\",\"不足500万元\",\"\"))","v":"未纳统"},null,{"v":60.7,"d":"60.70"}]
[10,{"$f":"[1]苏州工业园区工业企业技术改造经济效益表!B13","v":"百得（苏州）精密制造有限公司"},{"$f":"[1]苏州工业园区工业企业技术改造经济效益表!C13","v":"91320594789949394L"},{"$f":"[1]经济效益!N13","v":71},{"$f":"[1]智能化效益!R13","v":{"v":86.8643,"d":"86.86"}},{"$f":"IF([1]综合素质认定!O13>10,10,[1]综合素质认定!O13)","v":0},0,0,0,{"v":67.07286,"d":"67.07"},{"$f":"IF(J13<[1]奖补比例!$D$2,\"D\",IF(J13<[1]奖补比例!$C$2,\"C\",IF(J13<[1]奖补比例!$B$2,\"B\",\"A\")))","v":"B"},{"$f":"[1]苏州工业园区工业企业技术改造经济效益表!AJ13","v":512.03},{"$f":"[1]苏州工业园区工业企业技术改造经济效益表!AM13","v":308.41},{"$f":"IF([1]苏州工业园区工业企业技术改造经济效益表!AN13>=0.7,[1]苏州工业园区工业企业技术改造经济效益表!AM13,0)","v":0},{"$f":"IF(IF(K13=\"A\",[1]苏州工业园区工业企业技术改造经济效益表!AJ13*[1]奖补比例!$B$3+N13*[1]奖补比例!$B$5,IF(K13=\"B\",[1]苏州工业园区工业企业技术改造经济效益表!AJ13*[1]奖补比例!$C$3+N13*[1]奖补比例!$C$5,IF(K13=\"C\",[1]苏州工业园区工业企业技术改造经济效益表!AJ13*[1]奖补比例!$D$3+N13*[1]奖补比例!$D$5,[1]苏州工业园区工业企业技术改造经济效益表!AJ13*[1]奖补比例!$E$3+N13*[1]奖补比例!$E$5)))*[1]奖补比例!$G$2>1000,1000,IF(K13=\"A\",[1]苏州工业园区工业企业技术改造经济效益表!AJ13*[1]奖补比例!$B$3+N13*[1]奖补比例!$B$5,IF(K13=\"B\",[1]苏州工业园区工业企业技术改造经济效益表!AJ13*[1]奖补比例!$C$3+N13*[1]奖补比例!$C$5,IF(K13=\"C\",[1]苏州工业园区工业企业技术改造经济效益表!AJ13*[1]奖补比例!$D$3+N13*[1]奖补比例!$D$5,[1]苏州工业园区工业企业技术改造经济效益表!AJ13*[1]奖补比例!$E$3+N13*[1]奖补比例!$E$5)))*[1]奖补比例!$G$2)","v":{"v":32.6150002032,"d":"32.62"}},0,0,0,{"$f":"[1]【扣减】人工智能奖补!F12","v":0},0,{"$f":"[1]【扣减】投促委!F12","v":0},{"v":32.6150002032,"d":"32.62"},32.62,{"v":0.06369744,"d":"6.37%"},{"$f":"IF([1]项目纳统比对表!D13=\"否\",\"未纳统\",IF([1]项目纳统比对表!F13=\"否\",\"不足500万元\",\"\"))","v":"未纳统"},null,32.62]
[11,{"$f":"[1]苏州工业园区工业企业技术改造经济效益表!B14","v":"百得（苏州）科技有限公司"},{"$f":"[1]苏州工业园区工业企业技术改造经济效益表!C14","v":"913205947439059510"},{"$f":"[1]经济效益!N14","v":86},{"$f":"[1]智能化效益!R14","v":{"v":90.5392,"d":"90.54"}},{"$f":"IF([1]综合素质认定!O14>10,10,[1]综合素质认定!O14)","v":0},0,0,0,{"v":78.30784,"d":"78.31"},{"$f":"IF(J14<[1]奖补比例!$D$2,\"D\",IF(J14<[1]奖补比例!$C$2,\"C\",IF(J14<[1]奖补比例!$B$2,\"B\",\"A\")))","v":"B"},{"$f":"[1]苏州工业园区工业企业技术改造经济效益表!AJ14","v":3889.14},{"$f":"[1]苏州工业园区工业企业技术改造经济效益表!AM14","v":1518.69},{"$f":"IF([1]苏州工业园区工业企业技术改造经济效益表!AN14>=0.7,[1]苏州工业园区工业企业技术改造经济效益表!AM14,0)","v":0},{"$f":"IF(IF(K14=\"A\",[1]苏州工业园区工业企业技术改造经济效益表!AJ14*[1]奖补比例!$B$3+N14*[1]奖补比例!$B$5,IF(K14=\"B\",[1]苏州工业园区工业企业技术改造经济效益表!AJ14*[1]奖补比例!$C$3+N14*[1]奖补比例!$C$5,IF(K14=\"C\",[1]苏州工业园区工业企业技术改造经济效益表!AJ14*[1]奖补比例!$D$3+N14*[1]奖补比例!$D$5,[1]苏州工业园区工业企业技术改造经济效益表!AJ14*[1]奖补比例!$E$3+N14*[1]奖补比例!$E$5)))*[1]奖补比例!$G$2>1000,1000,IF(K14=\"A\",[1]苏州工业园区工业企业技术改造经济效益表!AJ14*[1]奖补比例!$B$3+N14*[1]奖补比例!$B$5,IF(K14=\"B\",[1]苏州工业园区工业企业技术改造经济效益表!AJ14*[1]奖补比例!$C$3+N14*[1]奖补比例!$C$5,IF(K14=\"C\",[1]苏州工业园区工业企业技术改造经济效益表!AJ14*[1]奖补比例!$D$3+N14*[1]奖补比例!$D$5,[1]苏州工业园区工业企业技术改造经济效益表!AJ14*[1]奖补比例!$E$3+N14*[1]奖补比例!$E$5)))*[1]奖补比例!$G$2)","v":{"v":247.7282618016,"d":"247.73"}},{"$f":"VLOOKUP(B14,[1]【扣减】省技改综合奖补!$C$2:$E$59,3,0)/10000","v":29},0,0,{"$f":"[1]【扣减】人工智能奖补!F13","v":0},0,{"$f":"[1]【扣减】投促委!F13","v":0},{"v":218.7282618016,"d":"218.73"},218.73,{"v":0.06369744,"d":"6.37%"},{"$f":"IF([1]项目纳统比对表!D14=\"否\",\"未纳统\",IF([1]项目纳统比对表!F14=\"否\",\"不足500万元\",\"\"))","v":"不足500万元"},null,218.73]
[12,{"$f":"[1]苏州工业园区工业企业技术改造经济效益表!B15","v":"佰电科技（苏州）有限公司"},{"$f":"[1]苏州工业园区工业企业技术改造经济效益表!C15","v":"9132059473829931XX"},{"$f":"[1]经济效益!N15","v":{"v":52.5997829194573,"d":"52.60"}},{"$f":"[1]智能化效益!R15","v":95},{"$f":"IF([1]综合素质认定!O15>10,10,[1]综合素质认定!O15)","v":1},0,0,0,{"v":56.8198480436201,"d":"56.82"},{"$f":"IF(J15<[1]奖补比例!$D$2,\"D\",IF(J15<[1]奖补比例!$C$2,\"C\",IF(J15<[1]奖补比例!$B$2,\"B\",\"A\")))","v":"C"},{"$f":"[1]苏州工业园区工业企业技术改造经济效益表!AJ15","v":879.31},{"$f":"[1]苏州工业园区工业企业技术改造经济效益表!AM15","v":38.62},{"$f":"IF([1]苏州工业园区工业企业技术改造经济效益表!AN15>=0.7,[1]苏州工业园区工业企业技术改造经济效益表!AM15,0)","v":0},{"$f":"IF(IF(K15=\"A\",[1]苏州工业园区工业企业技术改造经济效益表!AJ15*[1]奖补比例!$B$3+N15*[1]奖补比例!$B$5,IF(K15=\"B\",[1]苏州工业园区工业企业技术改造经济效益表!AJ15*[1]奖补比例!$C$3+N15*[1]奖补比例!$C$5,IF(K15=\"C\",[1]苏州工业园区工业企业技术改造经济效益表!AJ15*[1]奖补比例!$D$3+N15*[1]奖补比例!$D$5,[1]苏州工业园区工业企业技术改造经济效益表!AJ15*[1]奖补比例!$E$3+N15*[1]奖补比例!$E$5)))*[1]奖补比例!$G$2>1000,1000,IF(K15=\"A\",[1]苏州工业园区工业企业技术改造经济效益表!AJ15*[1]奖补比例!$B$3+N15*[1]奖补比例!$B$5,IF(K15=\"B\",[1]苏州工业园区工业企业技术改造经济效益表!AJ15*[1]奖补比例!$C$3+N15*[1]奖补比例!$C$5,IF(K15=\"C\",[1]苏州工业园区工业企业技术改造经济效益表!AJ15*[1]奖补比例!$D$3+N15*[1]奖补比例!$D$5,[1]苏州工业园区工业企业技术改造经济效益表!AJ15*[1]奖补比例!$E$3+N15*[1]奖补比例!$E$5)))*[1]奖补比例!$G$2)","v":{"v":35.006122479,"d":"35.01"}},0,0,0,{"$f":"[1]【扣减】人工智能奖补!F14","v":0},0,{"$f":"[1]【扣减】投促委!F14","v":0},{"v":35.006122479,"d":"35.01"},35.01,{"v":0.0398109,"d":"3.98%"},{"$f":"IF([1]项目纳统比对表!D15=\"否\",\"未纳统\",IF([1]项目纳统比对表!F15=\"否\",\"不足500万元\",\"\"))","v":"未纳统"},null,35.01]
{"$rows_left_out":124}
{"sheet":"奖补企业清单","index":1,"n_rows":134,"n_cols":5,"rows_kept":134,"merged":[[0,0,0,4],[3,0,16,0],[17,0,84,0],[85,0,113,0],[114,0,133,0],[134,0,134,2]]}
["2021年苏州工业园区产业转型升级（技术改造）专项资金奖补企业清单\n（项目实施期为2019年度）"]
[]
["奖补类别","序号","企业名称","奖补金额（万元）","备注"]
["技改卓越奖",1,"矽品科技（苏州）有限公司",{"v":923,"d":"923.00"}]
[null,2,"信达生物制药（苏州）有限公司",193.01]
[null,3,"苏州晶方半导体科技股份有限公司",276.98]
[null,4,"博世汽车部件（苏州）有限公司",{"v":0,"d":"0.00"},"扣除重复补贴后奖补金额为0"]
[null,5,"伟创力电子技术（苏州）有限公司",104.47]
[null,6,"苏州旭创科技有限公司",{"v":986,"d":"986.00"}]
[null,7,"京隆科技（苏州）有限公司",{"v":817,"d":"817.00"}]
[null,8,"苏州盛迪亚生物医药有限公司",747.42]
[null,9,"基美电子（苏州）有限公司",428.99]
[null,10,"苏州紫翔电子科技有限公司",{"v":948,"d":"948.00"}]
[null,11,"嘉盛半导体（苏州）有限公司",{"v":944,"d":"944.00"}]
[null,12,"苏州通富超威半导体有限公司",{"v":0,"d":"0.00"},"扣除重复补贴后奖补金额为0"]
{"$rows_left_out":119}